Target
5-hydroxytryptamine receptor 1A
Ligand
BDBM50001979
Substrate
Meas. Tech.
ChEBML_575
Ki
90±n/a nM
Citation
 Moon, MWMorris, JKHeier, RFChidester, CGHoffmann, WEPiercey, MFAlthaus, JSVon Voigtlander, PFEvans, DLFigur, LM Dopaminergic and serotonergic activities of imidazoquinolinones and related compounds. J Med Chem 35:1076-92 (1992)  
Target
Name:
5-hydroxytryptamine receptor 1A
Synonyms:
5-HT-1A 5-hydroxytryptamine receptor 1A (5-HT-1A) ADRB2RL1 Dopamine D2 receptor and serotonin 1a receptor HTR1A | Serotonin receptor 1A
Type:
Mol. Mass.:
46122.49
Organism:
Homo sapiens (Human)
Description:
Residue:
422
  
Inhibitor
Name:
BDBM50001979
Synonyms:
5-Dipropylamino-5,6-dihydro-1H,4H-imidazo[4,5,1-ij]quinoline-2-thione | CHEMBL12157
Type:
Small organic molecule
Emp. Form.:
C16H23N3S
Mol. Mass.:
289.439
SMILES:
CCCN(CCC)C1Cc2cccc3[nH]c(=S)n(C1)c23
: