Target
D(2) dopamine receptor
Ligand
BDBM50001987
Substrate
Meas. Tech.
ChEMBL_62419 (CHEMBL674823)
Ki
>10000±n/a nM
Citation
 Moon, MWMorris, JKHeier, RFChidester, CGHoffmann, WEPiercey, MFAlthaus, JSVon Voigtlander, PFEvans, DLFigur, LM Dopaminergic and serotonergic activities of imidazoquinolinones and related compounds. J Med Chem 35:1076-92 (1992)  
Target
Name:
D(2) dopamine receptor
Synonyms:
DOPAMINE D2 DOPAMINE D2 Short Dopamine D2 receptor Drd2
Type:
G Protein-Coupled Receptor (GPCR)
Mol. Mass.:
50931.60
Organism:
Rattus norvegicus (rat)
Description:
P61169
Residue:
444
  
Inhibitor
Name:
BDBM50001987
Synonyms:
5-Diallylamino-5,6-dihydro-1H,4H-imidazo[4,5,1-ij]quinolin-2-one | CHEMBL441331
Type:
Small organic molecule
Emp. Form.:
C16H19N3O
Mol. Mass.:
269.3416
SMILES:
C=CCN(CC=C)C1Cc2cccc3[nH]c(=O)n(C1)c23
: