Target
D(2) dopamine receptor
Ligand
BDBM50001978
Substrate
Meas. Tech.
ChEMBL_62419 (CHEMBL674823)
Ki
167±n/a nM
Citation
 Moon, MWMorris, JKHeier, RFChidester, CGHoffmann, WEPiercey, MFAlthaus, JSVon Voigtlander, PFEvans, DLFigur, LM Dopaminergic and serotonergic activities of imidazoquinolinones and related compounds. J Med Chem 35:1076-92 (1992)  
Target
Name:
D(2) dopamine receptor
Synonyms:
DOPAMINE D2 DOPAMINE D2 Short Dopamine D2 receptor Drd2
Type:
G Protein-Coupled Receptor (GPCR)
Mol. Mass.:
50931.60
Organism:
Rattus norvegicus (rat)
Description:
P61169
Residue:
444
  
Inhibitor
Name:
BDBM50001978
Synonyms:
5-(Butyl-propyl-amino)-5,6-dihydro-1H,4H-imidazo[4,5,1-ij]quinolin-2-one | CHEMBL12021
Type:
Small organic molecule
Emp. Form.:
C17H25N3O
Mol. Mass.:
287.3999
SMILES:
CCCCN(CCC)C1Cc2cccc3[nH]c(=O)n(C1)c23
: