Target
Muscarinic acetylcholine receptor M1
Ligand
BDBM50005492
Substrate
Meas. Tech.
ChEBML_138664
IC50
560±n/a nM
Citation
 Sowell, JWTang, YValli, MJChapman, JMUsher, LAVaughan, CMKosh, JW Synthesis and cholinergic properties of bis[[(dimethylamino)methyl]furanyl] analogues of ranitidine. J Med Chem 35:1102-8 (1992)  
Target
Name:
Muscarinic acetylcholine receptor M1
Synonyms:
ACM1_MOUSE Cholinergic, muscarinic Chrm1 Muscarinic acetylcholine receptor M1
Type:
Enzyme Catalytic Domain
Mol. Mass.:
51400.50
Organism:
Mus musculus
Description:
Cholinergic, muscarinic 0 0::Q52KQ0
Residue:
460
  
Inhibitor
Name:
BDBM50005492
Synonyms:
CHEMBL418712 | {5-[9-(5-Dimethylaminomethyl-furan-2-ylmethylsulfanyl)-nonylsulfanylmethyl]-furan-2-ylmethyl}-dimethyl-amine
Type:
Small organic molecule
Emp. Form.:
C25H42N2O2S2
Mol. Mass.:
466.743
SMILES:
CN(C)Cc1ccc(CSCCCCCCCCCSCc2ccc(CN(C)C)o2)o1
: