Target
Acetylcholinesterase
Ligand
BDBM50005503
Substrate
Meas. Tech.
ChEBML_28737
IC50
500±n/a nM
Citation
 Sowell, JWTang, YValli, MJChapman, JMUsher, LAVaughan, CMKosh, JW Synthesis and cholinergic properties of bis[[(dimethylamino)methyl]furanyl] analogues of ranitidine. J Med Chem 35:1102-8 (1992)  
Target
Name:
Acetylcholinesterase
Synonyms:
ACES_HUMAN Acetylcholinesterase (AChE) | Acetylcholinesterase (human AChE)
Type:
Enzyme
Mol. Mass.:
67792.70
Organism:
Homo sapiens (Human)
Description:
P22303
Residue:
614
  
Inhibitor
Name:
BDBM50005503
Synonyms:
CHEMBL13308 | {5-[2-(5-Dimethylaminomethyl-furan-2-ylmethylsulfanyl)-ethylsulfanylmethyl]-furan-2-ylmethyl}-dimethyl-amine
Type:
Small organic molecule
Emp. Form.:
C18H28N2O2S2
Mol. Mass.:
368.557
SMILES:
CN(C)Cc1ccc(CSCCSCc2ccc(CN(C)C)o2)o1
: