Target
Muscarinic acetylcholine receptor M2
Ligand
BDBM50005504
Substrate
Meas. Tech.
ChEBML_139893
IC50
500±n/a nM
Citation
 Sowell, JWTang, YValli, MJChapman, JMUsher, LAVaughan, CMKosh, JW Synthesis and cholinergic properties of bis[[(dimethylamino)methyl]furanyl] analogues of ranitidine. J Med Chem 35:1102-8 (1992)  
Target
Name:
Muscarinic acetylcholine receptor M2
Synonyms:
ACM2_MOUSE Chrm2 | Muscarinic acetylcholine receptor
Type:
PROTEIN
Mol. Mass.:
51515.43
Organism:
Mus musculus
Description:
ChEMBL_139897
Residue:
466
  
Inhibitor
Name:
BDBM50005504
Synonyms:
CHEMBL13206 | N-((5-Ethylsulfanylmethyl-furan-2-ylmethyl)-dimethyl-amine)l-N-[1-(((5-Ethylsulfanylmethyl-furan-2-ylmethyl)-dimethyl-amine)amino)-2-nitrovinyl]amine
Type:
Small organic molecule
Emp. Form.:
C22H35N5O4S2
Mol. Mass.:
497.674
SMILES:
CN(C)Cc1ccc(CSCCNCC(=NCCSCc2ccc(CN(C)C)o2)[N+]([O-])=O)o1
: