Target
Cholinesterase
Ligand
BDBM50005497
Substrate
Meas. Tech.
ChEMBL_41721 (CHEMBL659267)
IC50
3100±n/a nM
Citation
 Sowell, JWTang, YValli, MJChapman, JMUsher, LAVaughan, CMKosh, JW Synthesis and cholinergic properties of bis[[(dimethylamino)methyl]furanyl] analogues of ranitidine. J Med Chem 35:1102-8 (1992)  
Target
Name:
Cholinesterase
Synonyms:
Acylcholine acylhydrolase Butyrylcholine esterase (BChE) Butyrylcholinesterase (BuChE) CHLE_HUMAN Cholinesterases Pseudocholinesterase
Type:
Homotetramer
Mol. Mass.:
68422.27
Organism:
Homo sapiens (Human)
Description:
P06276
Residue:
602
  
Inhibitor
Name:
BDBM50005497
Synonyms:
CHEMBL12937 | {5-[4-(5-Dimethylaminomethyl-furan-2-ylmethylsulfanyl)-butylsulfanylmethyl]-furan-2-ylmethyl}-dimethyl-amine
Type:
Small organic molecule
Emp. Form.:
C20H32N2O2S2
Mol. Mass.:
396.61
SMILES:
CN(C)Cc1ccc(CSCCCCSCc2ccc(CN(C)C)o2)o1
: