Target
Sodium-dependent dopamine transporter
Ligand
BDBM50005543
Substrate
Meas. Tech.
ChEMBL_62168 (CHEMBL675011)
IC50
1050±n/a nM
Citation
 Carroll, FILewin, AHBoja, JWKuhar, MJ Cocaine receptor: biochemical characterization and structure-activity relationships of cocaine analogues at the dopamine transporter. J Med Chem 35:969-81 (1992)  
Target
Name:
Sodium-dependent dopamine transporter
Synonyms:
DA transporter SC6A3_RAT Sodium-dependent dopamine transporter | Sodium-dependent dopamine transporter (DAT)
Type:
Multi-pass membrane protein
Mol. Mass.:
68749.45
Organism:
Rattus norvegicus (rat)
Description:
P23977
Residue:
619
  
Inhibitor
Name:
BDBM50005543
Synonyms:
3-(4-Isothiocyanato-benzoyloxy)-8-methyl-8-aza-bicyclo[3.2.1]octane-2-carboxylic acid methyl ester | CHEMBL426954
Type:
Small organic molecule
Emp. Form.:
C18H20N2O4S
Mol. Mass.:
360.427
SMILES:
COC(=O)C1C2CC[C@H](C[C@@H]1OC(=O)c1ccc(cc1)N=C=S)N2C
: