Target
Sodium-dependent dopamine transporter
Ligand
BDBM50008039
Substrate
Meas. Tech.
ChEMBL_62165 (CHEMBL675008)
IC50
4±n/a nM
Citation
 Carroll, FILewin, AHBoja, JWKuhar, MJ Cocaine receptor: biochemical characterization and structure-activity relationships of cocaine analogues at the dopamine transporter. J Med Chem 35:969-81 (1992)  
Target
Name:
Sodium-dependent dopamine transporter
Synonyms:
DA transporter SC6A3_RAT Sodium-dependent dopamine transporter | Sodium-dependent dopamine transporter (DAT)
Type:
Multi-pass membrane protein
Mol. Mass.:
68749.45
Organism:
Rattus norvegicus (rat)
Description:
P23977
Residue:
619
  
Inhibitor
Name:
BDBM50008039
Synonyms:
3-Benzoyloxy-8-methyl-8-aza-bicyclo[3.2.1]octane-2-carboxylic acid | CHEMBL284394
Type:
Small organic molecule
Emp. Form.:
C16H19NO4
Mol. Mass.:
289.3264
SMILES:
CN1[C@@H]2CCC1C([C@H](C2)OC(=O)c1ccccc1)C(O)=O
: