Target
Sodium-dependent dopamine transporter
Ligand
BDBM50024215
Substrate
Meas. Tech.
ChEMBL_62800 (CHEMBL674113)
IC50
2480±n/a nM
Citation
 Carroll, FILewin, AHBoja, JWKuhar, MJ Cocaine receptor: biochemical characterization and structure-activity relationships of cocaine analogues at the dopamine transporter. J Med Chem 35:969-81 (1992)  
Target
Name:
Sodium-dependent dopamine transporter
Synonyms:
DA transporter SC6A3_RAT Sodium-dependent dopamine transporter | Sodium-dependent dopamine transporter (DAT)
Type:
Multi-pass membrane protein
Mol. Mass.:
68749.45
Organism:
Rattus norvegicus (rat)
Description:
P23977
Residue:
619
  
Inhibitor
Name:
BDBM50024215
Synonyms:
2-[1-(2-(1H-Imidazol-4-yl)-1-{3-methyl-1-[(2-methyl-1-{2-methyl-1-[(pyridin-2-ylmethyl)-carbamoyl]-butylcarbamoyl}-propylamino)-methyl]-butylcarbamoyl}-ethylcarbamoyl)-2-phenyl-ethylcarbamoyl]-2-methyl-pyrrolidine-1-carboxylic acid tert-butyl ester | CHEMBL3143431
Type:
Small organic molecule
Emp. Form.:
C49H74N10O7
Mol. Mass.:
915.1747
SMILES:
CC[C@H](C)[C@H](NC(=O)[C@@H](NC[C@H](CC(C)C)NC(=O)[C@H](Cc1c[nH]cn1)NC(=O)[C@H](Cc1ccccc1)NC(=O)[C@]1(C)CCCN1C(=O)OC(C)(C)C)C(C)C)C(=O)NCc1ccccn1
: