Target
Sodium-dependent dopamine transporter
Ligand
BDBM50005537
Substrate
Meas. Tech.
ChEMBL_62164 (CHEMBL675007)
IC50
8±n/a nM
Citation
 Carroll, FILewin, AHBoja, JWKuhar, MJ Cocaine receptor: biochemical characterization and structure-activity relationships of cocaine analogues at the dopamine transporter. J Med Chem 35:969-81 (1992)  
Target
Name:
Sodium-dependent dopamine transporter
Synonyms:
DA transporter SC6A3_RAT Sodium-dependent dopamine transporter | Sodium-dependent dopamine transporter (DAT)
Type:
Multi-pass membrane protein
Mol. Mass.:
68749.45
Organism:
Rattus norvegicus (rat)
Description:
P23977
Residue:
619
  
Inhibitor
Name:
BDBM50005537
Synonyms:
3-Benzoyloxy-2-methoxycarbonyl-8,8-dimethyl-8-azonia-bicyclo[3.2.1]octane | CHEMBL174532
Type:
Small organic molecule
Emp. Form.:
C18H24NO4
Mol. Mass.:
318.3869
SMILES:
COC(=O)C1C2CC[C@H](C[C@@H]1OC(=O)c1ccccc1)[N+]2(C)C
: