Target
Sodium-dependent dopamine transporter
Ligand
BDBM50005564
Substrate
Meas. Tech.
ChEMBL_62169 (CHEMBL675166)
IC50
1020±n/a nM
Citation
 Carroll, FILewin, AHBoja, JWKuhar, MJ Cocaine receptor: biochemical characterization and structure-activity relationships of cocaine analogues at the dopamine transporter. J Med Chem 35:969-81 (1992)  
Target
Name:
Sodium-dependent dopamine transporter
Synonyms:
DA transporter SC6A3_RAT Sodium-dependent dopamine transporter | Sodium-dependent dopamine transporter (DAT)
Type:
Multi-pass membrane protein
Mol. Mass.:
68749.45
Organism:
Rattus norvegicus (rat)
Description:
P23977
Residue:
619
  
Inhibitor
Name:
BDBM50005564
Synonyms:
8-Allyl-3-benzoyloxy-8-aza-bicyclo[3.2.1]octane-2-carboxylic acid methyl ester | CHEMBL425862
Type:
Small organic molecule
Emp. Form.:
C19H23NO4
Mol. Mass.:
329.3902
SMILES:
COC(=O)C1C2CC[C@H](C[C@@H]1OC(=O)c1ccccc1)N2CC=C
: