Target
Sodium-dependent dopamine transporter
Ligand
BDBM50005542
Substrate
Meas. Tech.
ChEMBL_62169 (CHEMBL675166)
IC50
43±n/a nM
Citation
 Carroll, FILewin, AHBoja, JWKuhar, MJ Cocaine receptor: biochemical characterization and structure-activity relationships of cocaine analogues at the dopamine transporter. J Med Chem 35:969-81 (1992)  
Target
Name:
Sodium-dependent dopamine transporter
Synonyms:
DA transporter SC6A3_RAT Sodium-dependent dopamine transporter | Sodium-dependent dopamine transporter (DAT)
Type:
Multi-pass membrane protein
Mol. Mass.:
68749.45
Organism:
Rattus norvegicus (rat)
Description:
P23977
Residue:
619
  
Inhibitor
Name:
BDBM50005542
Synonyms:
3-(4-Fluoro-phenyl)-8-propyl-8-aza-bicyclo[3.2.1]octane-2-carboxylic acid methyl ester | CHEMBL416818
Type:
Small organic molecule
Emp. Form.:
C18H24FNO2
Mol. Mass.:
305.3871
SMILES:
CCCN1C2CCC1C([C@H](C2)c1ccc(F)cc1)C(=O)OC
: