Target
Sodium-dependent dopamine transporter
Ligand
BDBM50005555
Substrate
Meas. Tech.
ChEMBL_62168 (CHEMBL675011)
IC50
112±n/a nM
Citation
 Carroll, FILewin, AHBoja, JWKuhar, MJ Cocaine receptor: biochemical characterization and structure-activity relationships of cocaine analogues at the dopamine transporter. J Med Chem 35:969-81 (1992)  
Target
Name:
Sodium-dependent dopamine transporter
Synonyms:
DA transporter SC6A3_RAT Sodium-dependent dopamine transporter | Sodium-dependent dopamine transporter (DAT)
Type:
Multi-pass membrane protein
Mol. Mass.:
68749.45
Organism:
Rattus norvegicus (rat)
Description:
P23977
Residue:
619
  
Inhibitor
Name:
BDBM50005555
Synonyms:
3-Benzoyloxy-8-methyl-8-aza-bicyclo[3.2.1]octane-2-carboxylic acid phenyl ester | CHEMBL176297
Type:
Small organic molecule
Emp. Form.:
C22H23NO4
Mol. Mass.:
365.4223
SMILES:
CN1[C@@H]2CCC1C([C@H](C2)OC(=O)c1ccccc1)C(=O)Oc1ccccc1
: