Target
Aminopeptidase N
Ligand
BDBM50036828
Substrate
Meas. Tech.
ChEMBL_35492 (CHEMBL646402)
IC50
30±n/a nM
Citation
 Fournié-Zaluski, MCCoric, PTurcaud, SBruetschy, LLucas, ENoble, FRoques, BP Potent and systemically active aminopeptidase N inhibitors designed from active-site investigation. J Med Chem 35:1259-66 (1992)  
Target
Name:
Aminopeptidase N
Synonyms:
AMPN_PIG AP-M Alanyl aminopeptidase Aminopeptidase N (APN) Microsomal aminopeptidase pAPN
Type:
Protein
Mol. Mass.:
108810.25
Organism:
Sus scrofa (Pig)
Description:
P15145
Residue:
963
  
Inhibitor
Name:
BDBM50036828
Synonyms:
1-Mercaptomethyl-2-phenyl-ethyl-ammonium CHEMBL414393
Type:
Small organic molecule
Emp. Form.:
C9H13NS
Mol. Mass.:
167.271
SMILES:
NC(CS)Cc1ccccc1
: