Target
Neprilysin
Ligand
BDBM50002038
Substrate
Meas. Tech.
ChEBML_144637
IC50
50±n/a nM
Citation
 Fournié-Zaluski, MCCoric, PTurcaud, SBruetschy, LLucas, ENoble, FRoques, BP Potent and systemically active aminopeptidase N inhibitors designed from active-site investigation. J Med Chem 35:1259-66 (1992)  
Target
Name:
Neprilysin
Synonyms:
Atriopeptidase CD_antigen=CD10 EPN MME NEP_HUMAN Neutral endopeptidase | Neutral endopeptidase 24.11
Type:
Enzyme
Mol. Mass.:
85505.38
Organism:
Homo sapiens (Human)
Description:
P08473
Residue:
750
  
Inhibitor
Name:
BDBM50002038
Synonyms:
2-(2-Mercapto-3-phenyl-propionylamino)-4-methyl-pentanoic acid | CHEMBL25432
Type:
Small organic molecule
Emp. Form.:
C15H21NO3S
Mol. Mass.:
295.397
SMILES:
CC(C)C[C@@H](NC(=O)C(S)Cc1ccccc1)C(O)=O
: