Target
Gag-Pol polyprotein [489-587]
Ligand
BDBM50005695
Substrate
Meas. Tech.
ChEMBL_159480 (CHEMBL769440)
IC50
1.9±n/a nM
Citation
 Tam, TFCarrière, JMacDonald, DCastelhano, ALPliura, DHDewdney, NJThomas, EMBach, CBarnett, JChan, H Intriguing structure-activity relations underlie the potent inhibition of HIV protease by norstatine-based peptides. J Med Chem 35:1318-20 (1992)  
Target
Name:
Gag-Pol polyprotein [489-587]
Synonyms:
Human immunodeficiency virus type 1 protease Pol polyprotein | gag-pol
Type:
Enzyme Subunit
Mol. Mass.:
10781.16
Organism:
Human immunodeficiency virus type 1
Description:
P04585[489-587]
Residue:
99
  
Inhibitor
Name:
BDBM50005695
Synonyms:
1-(2-Hydroxy-3-{3-methyl-2-[2-(naphthalen-1-yloxy)-acetylamino]-butyrylamino}-4-phenyl-butyryl)-pyrrolidine-2-carboxylic acid tert-butylamide CHEMBL335391
Type:
Small organic molecule
Emp. Form.:
C36H46N4O6
Mol. Mass.:
630.7736
SMILES:
CC(C)[C@H](NC(=O)COc1cccc2ccccc12)C(=O)N[C@@H](Cc1ccccc1)[C@H](O)C(=O)N1CCC[C@H]1C(=O)NC(C)(C)C
: