Target
Acetylcholinesterase
Ligand
BDBM50005771
Substrate
Meas. Tech.
ChEBML_28304
IC50
629±n/a nM
Citation
 Chen, YLNielsen, JHedberg, KDunaiskis, AJones, SRusso, LJohnson, JIves, JListon, D Syntheses, resolution, and structure-activity relationships of potent acetylcholinesterase inhibitors: 8-carbaphysostigmine analogues. J Med Chem 35:1429-34 (1992)  
Target
Name:
Acetylcholinesterase
Synonyms:
ACES_HUMAN Acetylcholinesterase (AChE) | Acetylcholinesterase (human AChE)
Type:
Enzyme
Mol. Mass.:
67792.70
Organism:
Homo sapiens (Human)
Description:
P22303
Residue:
614
  
Inhibitor
Name:
BDBM50005771
Synonyms:
(+/-)-Heptyl-carbamic acid 1-propyl-1,2,3,3a,8,8a-hexahydro-1-aza-cyclopenta[a]inden-5-yl ester | CHEMBL33098
Type:
Small organic molecule
Emp. Form.:
C22H34N2O2
Mol. Mass.:
358.5176
SMILES:
CCCCCCCNC(=O)Oc1ccc2CC3[C@@H](CCN3CCC)c2c1
: