Target
Purine nucleoside phosphorylase
Ligand
BDBM50005803
Substrate
Meas. Tech.
ChEBML_162178
IC50
42600±n/a nM
Citation
 Woo, PWKostlan, CRSircar, JCDong, MKGilbertsen, RB Inhibitors of human purine nucleoside phosphorylase. Synthesis and biological activities of 8-amino-3-benzylhypoxanthine and related analogues. J Med Chem 35:1451-7 (1992)  
Target
Name:
Purine nucleoside phosphorylase
Synonyms:
Inosine phosphorylase NP PNPH_HUMAN | Purine nucleoside phosphorylase (PNPase)
Type:
Enzyme
Mol. Mass.:
32119.53
Organism:
Homo sapiens (Human)
Description:
Residue:
289
  
Inhibitor
Name:
BDBM50005803
Synonyms:
8-Amino-3-benzyl-1,9-dihydro-purin-6-one | CHEMBL35668
Type:
Small organic molecule
Emp. Form.:
C12H11N5O
Mol. Mass.:
241.2486
SMILES:
Nc1nc2c(O)ncn(Cc3ccccc3)c2n1
: