Target
Cholecystokinin receptor type A
Ligand
BDBM50005810
Substrate
Meas. Tech.
ChEBML_50060
IC50
2580±n/a nM
Citation
 Fincham, CIHigginbottom, MHill, DRHorwell, DCO'Toole, JCRatcliffe, GSRees, DCRoberts, E Amide bond replacements incorporated into CCK-B selective"dipeptoids". J Med Chem 35:1472-84 (1992)  
Target
Name:
Cholecystokinin receptor type A
Synonyms:
CCKAR_RAT Cholecystokinin peripheral Cholecystokinin receptor type A
Type:
Enzyme Catalytic Domain
Mol. Mass.:
49676.37
Organism:
RAT
Description:
Cholecystokinin central 0 RAT::P30551
Residue:
444
  
Inhibitor
Name:
BDBM50005810
Synonyms:
CHEMBL286442 | [2-(1H-Indol-3-yl)-1-(2-phenethyl-4,5-dihydro-thiazol-5-yl)-ethyl]-carbamic acid adamantan-2-yl ester
Type:
Small organic molecule
Emp. Form.:
C32H37N3O2S
Mol. Mass.:
527.72
SMILES:
O=C(NC(Cc1c[nH]c2ccccc12)C1CN=C(CCc2ccccc2)S1)OC1[C@H]2C[C@@H]3C[C@@H](C[C@H]1C3)C2
: