Target
Gastrin/cholecystokinin type B receptor
Ligand
BDBM50005814
Substrate
Meas. Tech.
ChEBML_48256
IC50
1080±n/a nM
Citation
 Fincham, CIHigginbottom, MHill, DRHorwell, DCO'Toole, JCRatcliffe, GSRees, DCRoberts, E Amide bond replacements incorporated into CCK-B selective"dipeptoids". J Med Chem 35:1472-84 (1992)  
Target
Name:
Gastrin/cholecystokinin type B receptor
Synonyms:
Cckbr Cholecystokinin receptor Gastrin/cholecystokinin type B receptor
Type:
Enzyme Catalytic Domain
Mol. Mass.:
49196.59
Organism:
MOUSE
Description:
Cholecystokinin A CCKBR MOUSE::P56481
Residue:
453
  
Inhibitor
Name:
BDBM50005814
Synonyms:
CHEMBL422941 | [1-[(1-Hydroxymethyl-2-phenyl-ethyl)-methyl-carbamoyl]-2-(1H-indol-3-yl)-ethyl]-carbamic acid adamantan-2-yl ester;0.85chloroform
Type:
Small organic molecule
Emp. Form.:
C32H39N3O4
Mol. Mass.:
529.6698
SMILES:
CN(C(CO)Cc1ccccc1)C(=O)C(Cc1c[nH]c2ccccc12)NC(=O)OC1[C@H]2C[C@@H]3C[C@@H](C[C@H]1C3)C2
: