Target
Cholecystokinin receptor type A
Ligand
BDBM50005811
Substrate
Meas. Tech.
ChEBML_50060
IC50
852±n/a nM
Citation
 Fincham, CIHigginbottom, MHill, DRHorwell, DCO'Toole, JCRatcliffe, GSRees, DCRoberts, E Amide bond replacements incorporated into CCK-B selective"dipeptoids". J Med Chem 35:1472-84 (1992)  
Target
Name:
Cholecystokinin receptor type A
Synonyms:
CCKAR_RAT Cholecystokinin peripheral Cholecystokinin receptor type A
Type:
Enzyme Catalytic Domain
Mol. Mass.:
49676.37
Organism:
RAT
Description:
Cholecystokinin central 0 RAT::P30551
Residue:
444
  
Inhibitor
Name:
BDBM50005811
Synonyms:
CHEMBL285049 | [1-(1-Hydroxymethyl-2-phenyl-ethylcarbamoyl)-2-(1H-indol-3-yl)-ethyl]-carbamic acid adamantan-2-yl ester;0.5H2O
Type:
Small organic molecule
Emp. Form.:
C31H37N3O4
Mol. Mass.:
515.6432
SMILES:
OCC(Cc1ccccc1)NC(=O)C(Cc1c[nH]c2ccccc12)NC(=O)OC1[C@H]2C[C@@H]3C[C@@H](C[C@H]1C3)C2
: