Target
Cholecystokinin receptor type A
Ligand
BDBM50005815
Substrate
Meas. Tech.
ChEBML_50060
IC50
1230±n/a nM
Citation
 Fincham, CIHigginbottom, MHill, DRHorwell, DCO'Toole, JCRatcliffe, GSRees, DCRoberts, E Amide bond replacements incorporated into CCK-B selective"dipeptoids". J Med Chem 35:1472-84 (1992)  
Target
Name:
Cholecystokinin receptor type A
Synonyms:
CCKAR_RAT Cholecystokinin peripheral Cholecystokinin receptor type A
Type:
Enzyme Catalytic Domain
Mol. Mass.:
49676.37
Organism:
RAT
Description:
Cholecystokinin central 0 RAT::P30551
Residue:
444
  
Inhibitor
Name:
BDBM50005815
Synonyms:
CHEMBL280502 [1-(2-Hydroxymethyl-3-phenyl-propionylamino)-2-(1H-indol-3-yl)-ethyl]-carbamic acid adamantan-2-yl ester;0.2methyl tetrachloride
Type:
Small organic molecule
Emp. Form.:
C31H37N3O4
Mol. Mass.:
515.6432
SMILES:
OCC(Cc1ccccc1)C(=O)NC(Cc1c[nH]c2ccccc12)NC(=O)OC1[C@H]2C[C@@H]3C[C@@H](C[C@H]1C3)C2
: