Target
Gastrin/cholecystokinin type B receptor
Ligand
BDBM50005818
Substrate
Meas. Tech.
ChEBML_48256
IC50
1250±n/a nM
Citation
 Fincham, CIHigginbottom, MHill, DRHorwell, DCO'Toole, JCRatcliffe, GSRees, DCRoberts, E Amide bond replacements incorporated into CCK-B selective"dipeptoids". J Med Chem 35:1472-84 (1992)  
Target
Name:
Gastrin/cholecystokinin type B receptor
Synonyms:
Cckbr Cholecystokinin receptor Gastrin/cholecystokinin type B receptor
Type:
Enzyme Catalytic Domain
Mol. Mass.:
49196.59
Organism:
MOUSE
Description:
Cholecystokinin A CCKBR MOUSE::P56481
Residue:
453
  
Inhibitor
Name:
BDBM50005818
Synonyms:
CHEMBL285762 | [1-[(1-Hydroxymethyl-2-phenyl-ethylamino)-methyl]-2-(1H-indol-3-yl)-ethyl]-carbamic acid adamantan-2-yl ester;0.2H2O
Type:
Small organic molecule
Emp. Form.:
C31H39N3O3
Mol. Mass.:
501.6597
SMILES:
OCC(Cc1ccccc1)NCC(Cc1c[nH]c2ccccc12)NC(=O)OC1[C@H]2C[C@@H]3C[C@@H](C[C@H]1C3)C2
: