Target
Cholecystokinin receptor type A
Ligand
BDBM50005819
Substrate
Meas. Tech.
ChEBML_50060
IC50
1890±n/a nM
Citation
 Fincham, CIHigginbottom, MHill, DRHorwell, DCO'Toole, JCRatcliffe, GSRees, DCRoberts, E Amide bond replacements incorporated into CCK-B selective"dipeptoids". J Med Chem 35:1472-84 (1992)  
Target
Name:
Cholecystokinin receptor type A
Synonyms:
CCKAR_RAT Cholecystokinin peripheral Cholecystokinin receptor type A
Type:
Enzyme Catalytic Domain
Mol. Mass.:
49676.37
Organism:
RAT
Description:
Cholecystokinin central 0 RAT::P30551
Residue:
444
  
Inhibitor
Name:
BDBM50005819
Synonyms:
2-(Adamantan-2-yloxycarbonylamino)-3-(1H-indol-3-yl)-propionic acid 1-hydroxymethyl-2-phenyl-ethyl ester;0.25H2O | CHEMBL37903
Type:
Small organic molecule
Emp. Form.:
C31H36N2O5
Mol. Mass.:
516.6279
SMILES:
OCC(Cc1ccccc1)OC(=O)C(Cc1c[nH]c2ccccc12)NC(=O)OC1[C@H]2C[C@@H]3C[C@@H](C[C@H]1C3)C2
: