Target
Gastrin/cholecystokinin type B receptor
Ligand
BDBM50005821
Substrate
Meas. Tech.
ChEBML_48256
IC50
19500±n/a nM
Citation
 Fincham, CIHigginbottom, MHill, DRHorwell, DCO'Toole, JCRatcliffe, GSRees, DCRoberts, E Amide bond replacements incorporated into CCK-B selective"dipeptoids". J Med Chem 35:1472-84 (1992)  
Target
Name:
Gastrin/cholecystokinin type B receptor
Synonyms:
Cckbr Cholecystokinin receptor Gastrin/cholecystokinin type B receptor
Type:
Enzyme Catalytic Domain
Mol. Mass.:
49196.59
Organism:
MOUSE
Description:
Cholecystokinin A CCKBR MOUSE::P56481
Residue:
453
  
Inhibitor
Name:
BDBM50005821
Synonyms:
CHEMBL286093 | [1-(1H-Indol-3-ylmethyl)-1-methyl-5-phenyl-pentyl]-carbamic acid adamantan-2-yl ester;0.25H2O
Type:
Small organic molecule
Emp. Form.:
C32H40N2O2
Mol. Mass.:
484.6722
SMILES:
CC(CCCCc1ccccc1)(Cc1c[nH]c2ccccc12)NC(=O)OC1[C@H]2C[C@@H]3C[C@@H](C[C@H]1C3)C2
: