Target
Gastrin/cholecystokinin type B receptor
Ligand
BDBM50005828
Substrate
Meas. Tech.
ChEBML_48256
IC50
1190±n/a nM
Citation
 Fincham, CIHigginbottom, MHill, DRHorwell, DCO'Toole, JCRatcliffe, GSRees, DCRoberts, E Amide bond replacements incorporated into CCK-B selective"dipeptoids". J Med Chem 35:1472-84 (1992)  
Target
Name:
Gastrin/cholecystokinin type B receptor
Synonyms:
Cckbr Cholecystokinin receptor Gastrin/cholecystokinin type B receptor
Type:
Enzyme Catalytic Domain
Mol. Mass.:
49196.59
Organism:
MOUSE
Description:
Cholecystokinin A CCKBR MOUSE::P56481
Residue:
453
  
Inhibitor
Name:
BDBM50005828
Synonyms:
2-(Adamantan-2-yloxycarbonylamino)-3-(1H-indol-3-yl)-2-methyl-thiopropionic acid S-phenethyl ester | CHEMBL288038
Type:
Small organic molecule
Emp. Form.:
C31H36N2O3S
Mol. Mass.:
516.694
SMILES:
CC(Cc1c[nH]c2ccccc12)(NC(=O)OC1[C@H]2C[C@@H]3C[C@@H](C[C@H]1C3)C2)C(=O)SCCc1ccccc1
: