Target
Alpha-1A adrenergic receptor
Ligand
BDBM50005834
Substrate
Meas. Tech.
ChEBML_33282
Ki
>10000±n/a nM
Citation
 Flynn, DLZabrowski, DLBecker, DPNosal, RVillamil, CIGullikson, GWMoummi, CYang, DC SC-53116: the first selective agonist at the newly identified serotonin 5-HT4 receptor subtype. J Med Chem 35:1486-9 (1992)  
Target
Name:
Alpha-1A adrenergic receptor
Synonyms:
ADA1A_RAT Adra1c Alpha-1A adrenoceptor Alpha-1C adrenergic receptor | adrenergic Alpha1A
Type:
Protein
Mol. Mass.:
51620.15
Organism:
Rattus norvegicus (Rat)
Description:
P43140
Residue:
466
  
Inhibitor
Name:
BDBM50005834
Synonyms:
1-Isopropyl-3-[2-(8-methyl-8-aza-bicyclo[3.2.1]oct-3-yl)-acetyl]-1,3-dihydro-benzoimidazol-2-one | CHEMBL38041
Type:
Small organic molecule
Emp. Form.:
C20H27N3O2
Mol. Mass.:
341.4473
SMILES:
CC(C)n1c2ccccc2n(C(=O)CC2CC3CCC(C2)N3C)c1=O
: