Target
D(1A) dopamine receptor
Ligand
BDBM50005836
Substrate
Meas. Tech.
ChEBML_58795
Ki
1700±n/a nM
Citation
 Flynn, DLZabrowski, DLBecker, DPNosal, RVillamil, CIGullikson, GWMoummi, CYang, DC SC-53116: the first selective agonist at the newly identified serotonin 5-HT4 receptor subtype. J Med Chem 35:1486-9 (1992)  
Target
Name:
D(1A) dopamine receptor
Synonyms:
DOPAMINE D1 Dopamine D1 high Dopamine receptor Dopamine1-like Drd1a
Type:
Enzyme Catalytic Domain
Mol. Mass.:
49429.75
Organism:
RAT
Description:
P18901
Residue:
446
  
Inhibitor
Name:
BDBM50005836
Synonyms:
4-Amino-5-chloro-N-{1-[3-(4-fluoro-phenoxy)-propyl]-3-methoxy-piperidin-4-yl}-2-methoxy-benzamide CHEMBL560739 PROPULSID US10800776, Example Cisapride cid_5311047
Type:
Small organic molecule
Emp. Form.:
C23H29ClFN3O4
Mol. Mass.:
465.945
SMILES:
COC1CN(CCCOc2ccc(F)cc2)CCC1NC(=O)c1cc(Cl)c(N)cc1OC
: