Target
Alpha-1A adrenergic receptor
Ligand
BDBM50368604
Substrate
Meas. Tech.
ChEBML_33282
Ki
>10000±n/a nM
Citation
 Flynn, DLZabrowski, DLBecker, DPNosal, RVillamil, CIGullikson, GWMoummi, CYang, DC SC-53116: the first selective agonist at the newly identified serotonin 5-HT4 receptor subtype. J Med Chem 35:1486-9 (1992)  
Target
Name:
Alpha-1A adrenergic receptor
Synonyms:
ADA1A_RAT Adra1c Alpha-1A adrenoceptor Alpha-1C adrenergic receptor | adrenergic Alpha1A
Type:
Protein
Mol. Mass.:
51620.15
Organism:
Rattus norvegicus (Rat)
Description:
P43140
Residue:
466
  
Inhibitor
Name:
BDBM50368604
Synonyms:
CHEMBL1907770
Type:
Small organic molecule
Emp. Form.:
C15H18ClN3O2
Mol. Mass.:
307.775
SMILES:
[H]C12CN3C[C@]1(NC(=O)c1cc(Cl)c(N)cc1OC)C2CC3
: