Target
Kappa-type opioid receptor
Ligand
BDBM50000657
Substrate
Meas. Tech.
ChEMBL_146663 (CHEMBL753646)
Ki
>10000±n/a nM
Citation
 Heyl, DLMosberg, HI Substitution on the Phe3 aromatic ring in cyclic delta opioid receptor-selective dermorphin/deltorphin tetrapeptide analogues: electronic and lipophilic requirements for receptor affinity. J Med Chem 35:1535-41 (1992)  
Target
Name:
Kappa-type opioid receptor
Synonyms:
Kappa Opioid Receptor OPRK1 Opiate Kappa 1 | mu/kappa opioid receptor
Type:
G Protein-Coupled Receptor (GPCR)
Mol. Mass.:
42744.99
Organism:
Cavia porcellus (domestic guinea pig)
Description:
P41144
Residue:
380
  
Inhibitor
Name:
BDBM50000657
Synonyms:
10-[2-Amino-3-(4-hydroxy-phenyl)-propionylamino]-3,3-dimethyl-7-(4-nitro-benzyl)-6,9-dioxo-1,2-dithia-5,8-diaza-cycloundecane-4-carboxylic acid | CHEMBL37158
Type:
Small organic molecule
Emp. Form.:
C26H31N5O8S2
Mol. Mass.:
605.683
SMILES:
CC1(C)SSC[C@H](NC(=O)[C@@H](N)Cc2ccc(O)cc2)C(=O)N[C@@H](Cc2ccc(cc2)[N+]([O-])=O)C(=O)N[C@@H]1C(O)=O
: