Target
Mu-type opioid receptor
Ligand
BDBM50000655
Substrate
Meas. Tech.
ChEBML_145295
Ki
107±n/a nM
Citation
 Heyl, DLMosberg, HI Substitution on the Phe3 aromatic ring in cyclic delta opioid receptor-selective dermorphin/deltorphin tetrapeptide analogues: electronic and lipophilic requirements for receptor affinity. J Med Chem 35:1535-41 (1992)  
Target
Name:
Mu-type opioid receptor
Synonyms:
M-OR-1 Mu opioid receptor OPIATE Mu OPRM_CAVPO
Type:
Enzyme Catalytic Domain
Mol. Mass.:
11165.58
Organism:
GUINEA PIG
Description:
P97266
Residue:
98
  
Inhibitor
Name:
BDBM50000655
Synonyms:
(4R,7S,10R)-10-[(S)-2-Amino-3-(4-hydroxy-phenyl)-propionylamino]-7-benzyl-3,3-dimethyl-6,9-dioxo-1,2-dithia-5,8-diaza-cycloundecane-4-carboxylic acid CHEMBL39192
Type:
Small organic molecule
Emp. Form.:
C26H32N4O6S2
Mol. Mass.:
560.685
SMILES:
CC1(C)SSC[C@H](NC(=O)[C@@H](N)Cc2ccc(O)cc2)C(=O)N[C@@H](Cc2ccccc2)C(=O)N[C@@H]1C(O)=O
: