Target
Mu-type opioid receptor
Ligand
BDBM50000652
Substrate
Meas. Tech.
ChEMBL_146265 (CHEMBL757489)
Ki
56±n/a nM
Citation
 Heyl, DLMosberg, HI Substitution on the Phe3 aromatic ring in cyclic delta opioid receptor-selective dermorphin/deltorphin tetrapeptide analogues: electronic and lipophilic requirements for receptor affinity. J Med Chem 35:1535-41 (1992)  
Target
Name:
Mu-type opioid receptor
Synonyms:
M-OR-1 Mu opioid receptor OPIATE Mu OPRM_CAVPO
Type:
Enzyme Catalytic Domain
Mol. Mass.:
11165.58
Organism:
GUINEA PIG
Description:
P97266
Residue:
98
  
Inhibitor
Name:
BDBM50000652
Synonyms:
10-[2-Amino-3-(4-hydroxy-phenyl)-propionylamino]-7-(3-fluoro-benzyl)-3,3-dimethyl-6,9-dioxo-1,2-dithia-5,8-diaza-cycloundecane-4-carboxylic acid | CHEMBL289355
Type:
Small organic molecule
Emp. Form.:
C26H31FN4O6S2
Mol. Mass.:
578.676
SMILES:
CC1(C)SSC[C@H](NC(=O)[C@@H](N)Cc2ccc(O)cc2)C(=O)N[C@@H](Cc2cccc(F)c2)C(=O)N[C@@H]1C(O)=O
: