Target
Folylpolyglutamate synthase, mitochondrial
Ligand
BDBM50005859
Substrate
Meas. Tech.
ChEBML_68543
Ki
5700±n/a nM
Citation
 Rosowsky, AForsch, RAReich, VEFreisheim, JHMoran, RG Side chain modified 5-deazafolate and 5-deazatetrahydrofolate analogues as mammalian folylpolyglutamate synthetase and glycinamide ribonucleotide formyltransferase inhibitors: synthesis and in vitro biological evaluation. J Med Chem 35:1578-88 (1992)  
Target
Name:
Folylpolyglutamate synthase, mitochondrial
Synonyms:
FOLC_MOUSE Folylpolyglutamate synthase, mitochondrial Tetrahydrofolate synthase | Tetrahydrofolylpolyglutamate synthase
Type:
PROTEIN
Mol. Mass.:
64969.76
Organism:
Mus musculus
Description:
ChEMBL_68680
Residue:
587
  
Inhibitor
Name:
BDBM50005859
Synonyms:
5-Amino-2-{4-[(2,4-diamino-pyrido[3,2-d]pyrimidin-6-ylmethyl)-amino]-benzoylamino}-pentanoic acid | CHEMBL35921
Type:
Small organic molecule
Emp. Form.:
C20H24N8O3
Mol. Mass.:
424.4564
SMILES:
NCCCC(NC(=O)c1ccc(NCc2ccc3nc(N)nc(N)c3n2)cc1)C(O)=O
: