Target
Aromatase
Ligand
BDBM50406731
Substrate
Meas. Tech.
ChEMBL_50724 (CHEMBL664248)
IC50
2700±n/a nM
Citation
 Lesuisse, DGourvest, JFHartmann, CTric, BBenslimane, OPhilibert, DVevert, JP Synthesis and evaluation of a new series of mechanism-based aromatase inhibitors. J Med Chem 35:1588-97 (1992)  
Target
Name:
Aromatase
Synonyms:
ARO1 CP19A_HUMAN CYP19 CYPXIX Cytochrome P450 19A1 Cytochrome P450-C19 (CYP19) FL cytokine receptor precursor | P-450AROM
Type:
Enzyme
Mol. Mass.:
57888.92
Organism:
Homo sapiens (Human)
Description:
P11511
Residue:
503
  
Inhibitor
Name:
BDBM50406731
Synonyms:
CHEMBL2113524
Type:
Small organic molecule
Emp. Form.:
C20H26F2O2S
Mol. Mass.:
368.481
SMILES:
C[C@]12CC[C@H]3[C@@H](CCC4=C(SC(F)F)C(=O)CC[C@]34C)[C@@H]1CCC2=O
: