Target
Aromatase
Ligand
BDBM50005869
Substrate
Meas. Tech.
ChEMBL_50724 (CHEMBL664248)
IC50
10000±n/a nM
Citation
 Lesuisse, DGourvest, JFHartmann, CTric, BBenslimane, OPhilibert, DVevert, JP Synthesis and evaluation of a new series of mechanism-based aromatase inhibitors. J Med Chem 35:1588-97 (1992)  
Target
Name:
Aromatase
Synonyms:
ARO1 CP19A_HUMAN CYP19 CYPXIX Cytochrome P450 19A1 Cytochrome P450-C19 (CYP19) FL cytokine receptor precursor | P-450AROM
Type:
Enzyme
Mol. Mass.:
57888.92
Organism:
Homo sapiens (Human)
Description:
P11511
Residue:
503
  
Inhibitor
Name:
BDBM50005869
Synonyms:
4-Methoxymethylsulfanyl-10,13-dimethyl-1,6,7,8,9,10,11,12,13,14,15,16-dodecahydro-2H-cyclopenta[a]phenanthrene-3,17-dione | CHEMBL291279
Type:
Small organic molecule
Emp. Form.:
C21H30O3S
Mol. Mass.:
362.526
SMILES:
COCSC1=C2CCC3C4CCC(=O)[C@@]4(C)CCC3[C@@]2(C)CCC1=O
: