Target
Aromatase
Ligand
BDBM50005878
Substrate
Meas. Tech.
ChEMBL_51024 (CHEMBL664581)
Ki
27±n/a nM
Citation
 Lesuisse, DGourvest, JFHartmann, CTric, BBenslimane, OPhilibert, DVevert, JP Synthesis and evaluation of a new series of mechanism-based aromatase inhibitors. J Med Chem 35:1588-97 (1992)  
Target
Name:
Aromatase
Synonyms:
ARO1 CP19A_HUMAN CYP19 CYPXIX Cytochrome P450 19A1 Cytochrome P450-C19 (CYP19) FL cytokine receptor precursor | P-450AROM
Type:
Enzyme
Mol. Mass.:
57888.92
Organism:
Homo sapiens (Human)
Description:
P11511
Residue:
503
  
Inhibitor
Name:
BDBM50005878
Synonyms:
4-Chloromethylsulfanyl-10,13-dimethyl-1,6,7,8,10,12,13,14,15,16-decahydro-2H-cyclopenta[a]phenanthrene-3,17-dione | CHEMBL442542
Type:
Small organic molecule
Emp. Form.:
C20H25ClO2S
Mol. Mass.:
364.929
SMILES:
C[C@]12CC=C3C(CCC4=C(SCCl)C(=O)CC[C@]34C)C1CCC2=O
: