Target
Neutrophil elastase
Ligand
BDBM50005903
Substrate
Meas. Tech.
ChEMBL_63978 (CHEMBL677604)
Ki
430±n/a nM
Citation
 Zembower, DEKam, CMPowers, JCZalkow, LH Novel anthraquinone inhibitors of human leukocyte elastase and cathepsin G. J Med Chem 35:1597-605 (1992)  
Target
Name:
Neutrophil elastase
Synonyms:
Bone marrow serine protease Coagulation factor X ELANE Elastase HLE Leukocyte elastase Medullasin Neutrophil elastase (HNE) PMN elastase Trypsin
Type:
Enzyme
Mol. Mass.:
28532.38
Organism:
Homo sapiens (Human)
Description:
P08246
Residue:
267
  
Inhibitor
Name:
BDBM50005903
Synonyms:
CHEMBL44123 | Carbonic acid 8-butoxycarbonyloxy-7-hexyl-9,10-dioxo-9,10-dihydro-anthracen-1-yl ester butyl ester
Type:
Small organic molecule
Emp. Form.:
C30H36O8
Mol. Mass.:
524.602
SMILES:
CCCCCCc1ccc2C(=O)c3cccc(OC(=O)OCCCC)c3C(=O)c2c1OC(=O)OCCCC
: