Target
Purine nucleoside phosphorylase
Ligand
BDBM50230690
Substrate
Meas. Tech.
ChEMBL_162185 (CHEMBL766705)
Ki
2900±n/a nM
Citation
 Sircar, JCKostlan, CRGilbertsen, RBBennett, MKDong, MKCetenko, WJ Inhibitors of human purine nucleoside phosphorylase. Synthesis of pyrrolo[3,2-d]pyrimidines, a new class of purine nucleoside phosphorylase inhibitors as potentially T-cell selective immunosuppressive agents. Description of 2,6-diamino-3,5-dihydro-7-(3-thienylmethyl)-4H-pyrrolo[3,2-d] pyrimidin-4-o J Med Chem 35:1605-9 (1992)  
Target
Name:
Purine nucleoside phosphorylase
Synonyms:
Inosine phosphorylase NP PNPH_HUMAN | Purine nucleoside phosphorylase (PNPase)
Type:
Enzyme
Mol. Mass.:
32119.53
Organism:
Homo sapiens (Human)
Description:
Residue:
289
  
Inhibitor
Name:
BDBM50230690
Synonyms:
CHEMBL3143997
Type:
Small organic molecule
Emp. Form.:
C11H14N4O5
Mol. Mass.:
282.2527
SMILES:
NC1=NC(=O)C2NC=C([C@@H]3O[C@H](CO)[C@@H](O)[C@H]3O)C2=N1
: