Target
Acyl-CoA:cholesterol acyltransferase
Ligand
BDBM50005960
Substrate
Meas. Tech.
ChEBML_28339
IC50
60±n/a nM
Citation
 Roth, BDBlankley, CJHoefle, MLHolmes, ARoark, WHTrivedi, BKEssenburg, ADKieft, KAKrause, BRStanfield, RL Inhibitors of acyl-CoA:cholesterol acyltransferase. 1. Identification and structure-activity relationships of a novel series of fatty acid anilide hypocholesterolemic agents. J Med Chem 35:1609-17 (1992)  
Target
Name:
Acyl-CoA:cholesterol acyltransferase
Synonyms:
ACAT
Type:
Mol. Mass.:
35405.31
Organism:
Oryctolagus cuniculus
Description:
Residue:
305
  
Inhibitor
Name:
BDBM50005960
Synonyms:
2,4-Dimethyl-5-octadec-9-enoylamino-benzoic acid methyl ester | CHEMBL42433
Type:
Small organic molecule
Emp. Form.:
C28H45NO3
Mol. Mass.:
443.6618
SMILES:
CCCCCCCC\C=C\CCCCCCCC(=O)Nc1cc(C(=O)OC)c(C)cc1C
: