Target
Acyl-CoA:cholesterol acyltransferase
Ligand
BDBM50005995
Substrate
Meas. Tech.
ChEBML_28339
IC50
390±n/a nM
Citation
 Roth, BDBlankley, CJHoefle, MLHolmes, ARoark, WHTrivedi, BKEssenburg, ADKieft, KAKrause, BRStanfield, RL Inhibitors of acyl-CoA:cholesterol acyltransferase. 1. Identification and structure-activity relationships of a novel series of fatty acid anilide hypocholesterolemic agents. J Med Chem 35:1609-17 (1992)  
Target
Name:
Acyl-CoA:cholesterol acyltransferase
Synonyms:
ACAT
Type:
Mol. Mass.:
35405.31
Organism:
Oryctolagus cuniculus
Description:
Residue:
305
  
Inhibitor
Name:
BDBM50005995
Synonyms:
2,2-Dimethyl-dodecanoic acid (2,6-diethyl-phenyl)-amide | CHEMBL40470
Type:
Small organic molecule
Emp. Form.:
C24H41NO
Mol. Mass.:
359.5884
SMILES:
CCCCCCCCCCC(C)(C)C(=O)Nc1c(CC)cccc1CC
: