Target
Acyl-CoA:cholesterol acyltransferase
Ligand
BDBM50005982
Substrate
Meas. Tech.
ChEBML_28339
IC50
750±n/a nM
Citation
 Roth, BDBlankley, CJHoefle, MLHolmes, ARoark, WHTrivedi, BKEssenburg, ADKieft, KAKrause, BRStanfield, RL Inhibitors of acyl-CoA:cholesterol acyltransferase. 1. Identification and structure-activity relationships of a novel series of fatty acid anilide hypocholesterolemic agents. J Med Chem 35:1609-17 (1992)  
Target
Name:
Acyl-CoA:cholesterol acyltransferase
Synonyms:
ACAT
Type:
Mol. Mass.:
35405.31
Organism:
Oryctolagus cuniculus
Description:
Residue:
305
  
Inhibitor
Name:
BDBM50005982
Synonyms:
2,2-Dimethyl-dodecanoic acid (2-chloro-6-methyl-phenyl)-amide | CHEMBL43984
Type:
Small organic molecule
Emp. Form.:
C21H34ClNO
Mol. Mass.:
351.954
SMILES:
CCCCCCCCCCC(C)(C)C(=O)Nc1c(C)cccc1Cl
: