Target
Acyl-CoA:cholesterol acyltransferase
Ligand
BDBM50005955
Substrate
Meas. Tech.
ChEBML_28339
IC50
7±n/a nM
Citation
 Roth, BDBlankley, CJHoefle, MLHolmes, ARoark, WHTrivedi, BKEssenburg, ADKieft, KAKrause, BRStanfield, RL Inhibitors of acyl-CoA:cholesterol acyltransferase. 1. Identification and structure-activity relationships of a novel series of fatty acid anilide hypocholesterolemic agents. J Med Chem 35:1609-17 (1992)  
Target
Name:
Acyl-CoA:cholesterol acyltransferase
Synonyms:
ACAT
Type:
Mol. Mass.:
35405.31
Organism:
Oryctolagus cuniculus
Description:
Residue:
305
  
Inhibitor
Name:
BDBM50005955
Synonyms:
CHEMBL40608 | Octadec-9-enoic acid (2,6-diisopropyl-phenyl)-amide
Type:
Small organic molecule
Emp. Form.:
C30H51NO
Mol. Mass.:
441.732
SMILES:
CCCCCCCC\C=C\CCCCCCCC(=O)Nc1c(cccc1C(C)C)C(C)C
: