Target
Acyl-CoA:cholesterol acyltransferase
Ligand
BDBM50005941
Substrate
Meas. Tech.
ChEBML_28339
IC50
54±n/a nM
Citation
 Roth, BDBlankley, CJHoefle, MLHolmes, ARoark, WHTrivedi, BKEssenburg, ADKieft, KAKrause, BRStanfield, RL Inhibitors of acyl-CoA:cholesterol acyltransferase. 1. Identification and structure-activity relationships of a novel series of fatty acid anilide hypocholesterolemic agents. J Med Chem 35:1609-17 (1992)  
Target
Name:
Acyl-CoA:cholesterol acyltransferase
Synonyms:
ACAT
Type:
Mol. Mass.:
35405.31
Organism:
Oryctolagus cuniculus
Description:
Residue:
305
  
Inhibitor
Name:
BDBM50005941
Synonyms:
CHEMBL40809 | Hexadecanoic acid (2,4,6-trimethoxy-phenyl)-amide
Type:
Small organic molecule
Emp. Form.:
C25H43NO4
Mol. Mass.:
421.6132
SMILES:
CCCCCCCCCCCCCCCC(=O)Nc1c(OC)cc(OC)cc1OC
: