Target
Acyl-CoA:cholesterol acyltransferase
Ligand
BDBM50005978
Substrate
Meas. Tech.
ChEBML_28339
IC50
3000±n/a nM
Citation
 Roth, BDBlankley, CJHoefle, MLHolmes, ARoark, WHTrivedi, BKEssenburg, ADKieft, KAKrause, BRStanfield, RL Inhibitors of acyl-CoA:cholesterol acyltransferase. 1. Identification and structure-activity relationships of a novel series of fatty acid anilide hypocholesterolemic agents. J Med Chem 35:1609-17 (1992)  
Target
Name:
Acyl-CoA:cholesterol acyltransferase
Synonyms:
ACAT
Type:
Mol. Mass.:
35405.31
Organism:
Oryctolagus cuniculus
Description:
Residue:
305
  
Inhibitor
Name:
BDBM50005978
Synonyms:
(2-Methyl-4-octadec-9-enoylamino-phenyl)-acetic acid ethyl ester | CHEMBL40767
Type:
Small organic molecule
Emp. Form.:
C29H47NO3
Mol. Mass.:
457.6884
SMILES:
CCCCCCCC\C=C\CCCCCCCC(=O)Nc1ccc(CC(=O)OCC)c(C)c1
: