Target
Platelet-activating factor receptor
Ligand
BDBM50006088
Substrate
Meas. Tech.
ChEBML_221704
IC50
9900±n/a nM
Citation
 Wissner, ACarroll, MLGreen, KEKerwar, SSPickett, WCSchaub, RETorley, LWWrenn, SKohler, CA Analogues of platelet activating factor. 6. Mono- and bis-aryl phosphate antagonists of platelet activating factor. J Med Chem 35:1650-62 (1992)  
Target
Name:
Platelet-activating factor receptor
Synonyms:
PAF-R PTAFR_CAVPO Platelet-activating factor receptor
Type:
Protein
Mol. Mass.:
39005.63
Organism:
Cavia porcellus
Description:
Residue:
342
  
Inhibitor
Name:
BDBM50006088
Synonyms:
3-{3-[(2,4-Dichloro-5-tetradecyloxy-phenoxy)-hydroxy-phosphoryloxy]-benzyl}-5-methyl-thiazol-3-ium | CHEMBL44740
Type:
Small organic molecule
Emp. Form.:
C31H42Cl2NO5PS
Mol. Mass.:
642.614
SMILES:
CCCCCCCCCCCCCCOc1cc(OP([O-])(=O)Oc2cccc(C[n+]3csc(C)c3)c2)c(Cl)cc1Cl
: