Target
Platelet-activating factor receptor
Ligand
BDBM50006010
Substrate
Meas. Tech.
ChEBML_221704
IC50
810±n/a nM
Citation
 Wissner, ACarroll, MLGreen, KEKerwar, SSPickett, WCSchaub, RETorley, LWWrenn, SKohler, CA Analogues of platelet activating factor. 6. Mono- and bis-aryl phosphate antagonists of platelet activating factor. J Med Chem 35:1650-62 (1992)  
Target
Name:
Platelet-activating factor receptor
Synonyms:
PAF-R PTAFR_CAVPO Platelet-activating factor receptor
Type:
Protein
Mol. Mass.:
39005.63
Organism:
Cavia porcellus
Description:
Residue:
342
  
Inhibitor
Name:
BDBM50006010
Synonyms:
3-{3-[(2-Ethyl-4-tetradecyloxy-phenoxy)-hydroxy-phosphoryloxy]-benzyl}-5-methyl-thiazol-3-ium | CHEMBL445355
Type:
Small organic molecule
Emp. Form.:
C33H48NO5PS
Mol. Mass.:
601.777
SMILES:
CCCCCCCCCCCCCCOc1ccc(OP([O-])(=O)Oc2cccc(C[n+]3csc(C)c3)c2)c(CC)c1
: