Target
Platelet-activating factor receptor
Ligand
BDBM50006045
Substrate
Meas. Tech.
ChEBML_221704
IC50
1610±n/a nM
Citation
 Wissner, ACarroll, MLGreen, KEKerwar, SSPickett, WCSchaub, RETorley, LWWrenn, SKohler, CA Analogues of platelet activating factor. 6. Mono- and bis-aryl phosphate antagonists of platelet activating factor. J Med Chem 35:1650-62 (1992)  
Target
Name:
Platelet-activating factor receptor
Synonyms:
PAF-R PTAFR_CAVPO Platelet-activating factor receptor
Type:
Protein
Mol. Mass.:
39005.63
Organism:
Cavia porcellus
Description:
Residue:
342
  
Inhibitor
Name:
BDBM50006045
Synonyms:
3-{3-[(4-Hexadecyloxy-phenoxy)-hydroxy-phosphoryloxy]-benzyl}-thiazol-3-ium | CHEMBL44060
Type:
Small organic molecule
Emp. Form.:
C32H46NO5PS
Mol. Mass.:
587.75
SMILES:
CCCCCCCCCCCCCCCCOc1ccc(OP([O-])(=O)Oc2cccc(C[n+]3ccsc3)c2)cc1
: