Target
Platelet-activating factor receptor
Ligand
BDBM50006079
Substrate
Meas. Tech.
ChEBML_221704
IC50
157000±n/a nM
Citation
 Wissner, ACarroll, MLGreen, KEKerwar, SSPickett, WCSchaub, RETorley, LWWrenn, SKohler, CA Analogues of platelet activating factor. 6. Mono- and bis-aryl phosphate antagonists of platelet activating factor. J Med Chem 35:1650-62 (1992)  
Target
Name:
Platelet-activating factor receptor
Synonyms:
PAF-R PTAFR_CAVPO Platelet-activating factor receptor
Type:
Protein
Mol. Mass.:
39005.63
Organism:
Cavia porcellus
Description:
Residue:
342
  
Inhibitor
Name:
BDBM50006079
Synonyms:
1-{3-[(3-Hexadecyloxy-2-methoxy-propoxy)-hydroxy-phosphoryloxy]-benzyl}-1H-imidazol-1-ium | CHEMBL297825
Type:
Small organic molecule
Emp. Form.:
C30H51N2O6P
Mol. Mass.:
566.7095
SMILES:
CCCCCCCCCCCCCCCCOCC(COP([O-])(=O)Oc1cccc(C[NH+]2C=CN=C2)c1)OC
: