Target
Platelet-activating factor receptor
Ligand
BDBM50006069
Substrate
Meas. Tech.
ChEBML_221704
IC50
11800±n/a nM
Citation
 Wissner, ACarroll, MLGreen, KEKerwar, SSPickett, WCSchaub, RETorley, LWWrenn, SKohler, CA Analogues of platelet activating factor. 6. Mono- and bis-aryl phosphate antagonists of platelet activating factor. J Med Chem 35:1650-62 (1992)  
Target
Name:
Platelet-activating factor receptor
Synonyms:
PAF-R PTAFR_CAVPO Platelet-activating factor receptor
Type:
Protein
Mol. Mass.:
39005.63
Organism:
Cavia porcellus
Description:
Residue:
342
  
Inhibitor
Name:
BDBM50006069
Synonyms:
3-{3-[Hydroxy-(2,3,5,6-tetrachloro-4-tetradecyloxy-phenoxy)-phosphoryloxy]-benzyl}-5-methyl-thiazol-3-ium | CHEMBL44597
Type:
Small organic molecule
Emp. Form.:
C31H40Cl4NO5PS
Mol. Mass.:
711.504
SMILES:
CCCCCCCCCCCCCCOc1c(Cl)c(Cl)c(OP([O-])(=O)Oc2cccc(C[n+]3csc(C)c3)c2)c(Cl)c1Cl
: